BDBM50160151 2-(2-(4-(2-methoxyphenyl)piperazin-1-yl)ethyl)-4,4-dimethylisoquinoline-1,3(2H,4H)-dione::2-{2-[4-(2-Methoxy-phenyl)-piperazin-1-yl]-ethyl}-4,4-dimethyl-4H-isoquinoline-1,3-dione::ARC-239::CHEMBL362051
SMILES COc1ccccc1N1CCN(CCN2C(=O)c3ccccc3C(C)(C)C2=O)CC1
InChI Key InChIKey=JFNKXGOEOQCXDM-UHFFFAOYSA-N
Data  1 KI
  Tab Delimited (TSV)   2D SDfile   Computed 3D by Vconf -m prep SDfile
Find this compound or compounds like it in BindingDB:
Activity Spreadsheet -- Enzyme Inhibition Constant Data from BindingDB
Found 1 hit for monomerid = 50160151
TargetAlpha-1A adrenergic receptor(Homo sapiens (Human))
China Pharmaceutical University
Curated by ChEMBL
LigandPNGBDBM50160151(2-(2-(4-(2-methoxyphenyl)piperazin-1-yl)ethyl)-4,4...)
Affinity DataKi:  1nM. Assay description: Binding constant measured against Alpha-1A adrenergic receptor in human prostate; ++:moderately active
In DepthDetails ArticlePubMed